Target
Ectonucleotide pyrophosphatase/phosphodiesterase family member 2
Ligand
BDBM258544
Substrate
Meas. Tech.
Enzyme Inhibition Assay
pH
8±n/a
Temperature
303.15±n/a K
IC50
7243.5±n/a nM
Comments
extracted
Citation
 Hunziker, DMattei, PMauser, HPrunotto, MUllmer, C Diazaspirocycloalkane and azaspirocycloalkane US Patent  US9493486 Publication Date 11/15/2016 
Target
Name:
Ectonucleotide pyrophosphatase/phosphodiesterase family member 2
Synonyms:
ATX Autotaxin (ATX) ENPP2 Ectonucleotide Pyrophosphatase/Phosphodiesterase 2 (ENPP2) Extracellular lysophospholipase D PDNP2
Type:
Enzyme
Mol. Mass.:
99007.13
Organism:
Homo sapiens (Human)
Description:
Q13822
Residue:
863
  
Inhibitor
Name:
BDBM258544
Synonyms:
US10633384, Example 12.06 | US9493486, 12.06
Type:
Small organic molecule
Emp. Form.:
C23H24ClN5O5S
Mol. Mass.:
517.985
SMILES:
CS(=O)(=O)c1cc(COC(=O)N2CCC3(CN(C3)C(=O)c3ccc4[nH]nnc4c3)CC2)ccc1Cl
: