Target
Cyclin-T1/Cyclin-dependent kinase 9
Ligand
BDBM258866
Substrate
Meas. Tech.
CDK9/CycT1 Kinase Assay
pH
8±n/a
Temperature
295.15±n/a K
IC50
11±n/a nM
Comments
extracted
Citation
 Lücking, UKosemund, DBohlmann, RScholz, ALienau, PSiemeister, GBömer, U 4-(ortho)-fluorophenyl-5-fluoropyrimidin-2-yl amines containing a sulfoximine group US Patent  US9499492 Publication Date 11/22/2016 
Target
Name:
Cyclin-T1/Cyclin-dependent kinase 9
Synonyms:
CDK9/ Cyclin-T1 CDK9/Cyclin T Cyclin T1/dependent kinase 9 | Cyclin-Dependent Kinase 9 (CDK9)
Type:
Protein Complex
Mol. Mass.:
Description:
Components:
This complex has 2 components.
Component 1
Name:
Cyclin-T1
Synonyms:
CCNT1 CycT Cyclin T Cyclin-T
Type:
Enzyme Subunit
Mol. Mass.:
80712.40
Organism:
Homo sapiens (Human)
Description:
Residue:
726
  
Component 2
Name:
Cyclin-dependent kinase 9
Synonyms:
C-2K CDK9 Cell division cycle 2-like protein kinase 4 Cyclin-Dependent Kinase 9 (CDK9) Serine/threonine-protein kinase PITALRE Tat-associated kinase complex catalytic subunit
Type:
Enzyme Subunit
Mol. Mass.:
42789.13
Organism:
Homo sapiens (Human)
Description:
Residue:
372
  
Inhibitor
Name:
BDBM258866
Synonyms:
US9499492, 18
Type:
Small organic molecule
Emp. Form.:
C19H13BrF3N5OS
Mol. Mass.:
496.304
SMILES:
CS(=O)(Cc1cc(Br)cc(Nc2ncc(F)c(n2)-c2ccc(F)cc2F)c1)=NC#N
: