Target
Beta-secretase 1
Ligand
BDBM258910
Substrate
Meas. Tech.
BACE1 HTRF FRET Assay
pH
5±n/a
Temperature
303.15±n/a K
Ki
2.6±n/a nM
Comments
extracted
Citation
 Wu, WBurnett, DAStamford, AWCumming, JNBennett, CEGilbert, EJScott, JDYu, YPeng, X 5-substituted iminothiazines and their mono- and dioxides as BACE inhibitors, compositions, and their use US Patent  US9499502 Publication Date 11/22/2016 
Target
Name:
Beta-secretase 1
Synonyms:
ASP2 Aspartyl protease 2 BACE1 Beta-secretase (BACE) Beta-secretase 1 (BACE 1) Beta-secretase 1 (BACE1) Beta-site amyloid precursor protein cleaving enzyme 1 Memapsin-2 beta-Secretase (BACE-1) | beta-Secretase (BACE1)
Type:
Protein
Mol. Mass.:
55755.10
Organism:
Homo sapiens (Human)
Description:
P56817
Residue:
501
  
Inhibitor
Name:
BDBM258910
Synonyms:
US9499502, 9p
Type:
Small organic molecule
Emp. Form.:
C22H26FN5O4S
Mol. Mass.:
475.536
SMILES:
CC1(C)C(=N)N[C@@](C)(CS1(=O)=O)c1cc(NC(=O)c2cnc(OCC3CC3)cn2)ccc1F
: