Target
Glutathione S-transferase P/Isoform 2 of MAP kinase-interacting serine/threonine-protein kinase 1 (MNK1a) [T344D]
Ligand
BDBM259296
Substrate
Meas. Tech.
Kinase High ATP Assay
pH
7.5±n/a
Temperature
295.15±n/a K
IC50
5±n/a nM
Comments
extracted
Citation
 Eis, KPuehler, FZorn, LScholz, ALienau, PGnoth, MJBömer, UGünther, JHitchcock, M Amino-substituted imidazopyridazines US Patent  US9499547 Publication Date 11/22/2016 
Target
Name:
Glutathione S-transferase P/Isoform 2 of MAP kinase-interacting serine/threonine-protein kinase 1 (MNK1a) [T344D]
Synonyms:
GST-MAP kinase-interacting serine/threonine-protein kinase 1 (MKNK1) (T344D) | Glutathione S-transferase P/MAP kinase-interacting serine/threonine-protein kinase 1 (MNK1a) [T344D]
Type:
Enzyme
Mol. Mass.:
Description:
Components:
This complex has 2 components.
Component 1
Name:
Glutathione S-transferase P
Synonyms:
FAEES3 GST3 GSTP1-1 Glutathione S-transferase Glutathione S-transferase P Glutathione transferase (GST)
Type:
Enzyme
Mol. Mass.:
23353.53
Organism:
Homo sapiens (Human)
Description:
P09211
Residue:
210
  
Component 2
Name:
Isoform 2 of MAP kinase-interacting serine/threonine-protein kinase 1 (MNK1a) 344D]
Synonyms:
Isoform 2 of MAP kinase-interacting serine/threonine-protein kinase 1 (MNK1a) 344D] MAP kinase signal-integrating kinase 1 (MNK1) (T344D) MAP kinase-interacting serine/threonine-protein kinase 1 (MKNK1) (T344D) MAP kinase-interacting serine/threonine-protein kinase 1 (MNK1a) [T344D] MKNK1 MKNK1_HUMAN MNK1a
Type:
Protein
Mol. Mass.:
47416.00
Organism:
Homo sapiens (Human)
Description:
Q9BUB5-2 with T344D
Residue:
424
  
Inhibitor
Name:
BDBM259296
Synonyms:
US9499547, 37
Type:
Small organic molecule
Emp. Form.:
C18H15ClN4O2
Mol. Mass.:
354.79
SMILES:
N[C@H]1C[C@@H](C1)Oc1ccc2ncc(-c3cc4cc(Cl)ccc4o3)n2n1
: