Target
Cannabinoid receptor 2
Ligand
BDBM259723
Substrate
Meas. Tech.
cAMP Assay
Temperature
310.15±n/a K
EC50
1.7±n/a nM
Comments
extracted
Citation
 Bendels, SGrether, UKimbara, ANettekoven, MRoever, SRogers-Evans, MSchulz-Gasch, T Purine derivatives as CB2 receptor agonists US Patent  US9505762 Publication Date 11/29/2016 
Target
Name:
Cannabinoid receptor 2
Synonyms:
CANNABINOID CB2 CB2 CB2B CNR2_HUMAN Cannabinoid CB2 receptor Cannabinoid receptor 2 (CB2R) | hCB2
Type:
G Protein-Coupled Receptor (GPCR)
Mol. Mass.:
39690.94
Organism:
Homo sapiens (Human)
Description:
P34972
Residue:
360
  
Inhibitor
Name:
BDBM259723
Synonyms:
US9505762, 91
Type:
Small organic molecule
Emp. Form.:
C19H23ClN6O
Mol. Mass.:
386.879
SMILES:
CC(C)(C)c1nc(N2CC[C@H](O)C2)c2ncn(Cc3cccnc3Cl)c2n1
: