Target
Phosphatidylinositol 4,5-bisphosphate 3-kinase catalytic subunit delta isoform
Ligand
BDBM50427485
Substrate
Meas. Tech.
Inhibition Assay
IC50
21±n/a nM
Citation
 Durden, DLMorales, GAGarlich, JR Thienopyranones as kinase and epigenetic inhibitors US Patent  US9505780 Publication Date 11/29/2016 
Target
Name:
Phosphatidylinositol 4,5-bisphosphate 3-kinase catalytic subunit delta isoform
Synonyms:
PI3-kinase p110 subunit delta PI3-kinase subunit p110-delta PIK3CD Phosphatidylinositol 4,5-biphosphate 3-kinase catalytic subunit delta (PIK3CD) Phosphatidylinositol 4,5-bisphosphate 3-kinase 110 kDa catalytic subunit delta (PI3K delta) Phosphatidylinositol 4,5-bisphosphate 3-kinase catalytic subunit delta (PI3Kdelta) Phosphatidylinositol 4,5-bisphosphate 3-kinase catalytic subunit delta isoform (PI3K delta) Phosphatidylinositol 4,5-bisphosphate 3-kinase catalytic subunit delta isoform (PI3K-delta) Phosphatidylinositol 4,5-bisphosphate 3-kinase catalytic subunit delta isoform (PI3Kdelta)
Type:
Enzyme Subunit
Mol. Mass.:
119489.41
Organism:
Homo sapiens (Human)
Description:
O00329
Residue:
1044
  
Inhibitor
Name:
BDBM50427485
Synonyms:
CHEMBL2326959 US9505780, 120
Type:
Small organic molecule
Emp. Form.:
C23H19N3O4S
Mol. Mass.:
433.48
SMILES:
O=C(Nc1ccc(cc1)-c1csc2c1oc(cc2=O)N1CCOCC1)c1ccncc1
: