Target
Hepatocyte growth factor receptor
Ligand
BDBM259951
Substrate
Meas. Tech.
Inhibition Assay
Temperature
293.15±n/a K
IC50
174.8±n/a nM
Comments
extracted
Citation
 Zhao, ZWang, HWu, CQi, Q [1,2,4] triazol [4,3-A] pyridine derivative, preparation method therefor or medical application thereof US Patent  US9512121 Publication Date 12/6/2016 
Target
Name:
Hepatocyte growth factor receptor
Synonyms:
Hepatocyte growth factor receptor Hepatocyte growth factor receptor (c-MET) MET Met proto-oncogene (hepatocyte growth factor receptor) Tyrosine-protein kinase Met (c-Met) c-Met kinase
Type:
Protein
Mol. Mass.:
155559.73
Organism:
Homo sapiens (Human)
Description:
P08581
Residue:
1390
  
Inhibitor
Name:
BDBM259951
Synonyms:
US9512121, 35
Type:
Small organic molecule
Emp. Form.:
C23H23N7OS
Mol. Mass.:
445.54
SMILES:
COCCN(C)c1ccnc2ccc(Sc3nnc4ccc(cn34)-c3cnn(C)c3)cc12
: