Target
Cannabinoid receptor 2
Ligand
BDBM260079
Substrate
Meas. Tech.
cAMP Assay
Temperature
310.15±n/a K
EC50
3±n/a nM
Comments
extracted
Citation
 Frei, BGobbi, LGrether, UKimbara, ANettekoven, MRoever, SRogers-Evans, MSchulz-Gasch, T Pyridine derivatives US Patent  US9522886 Publication Date 12/20/2016 
Target
Name:
Cannabinoid receptor 2
Synonyms:
CANNABINOID CB2 CB2 CB2B CNR2_HUMAN Cannabinoid CB2 receptor Cannabinoid receptor 2 (CB2R) | hCB2
Type:
G Protein-Coupled Receptor (GPCR)
Mol. Mass.:
39690.94
Organism:
Homo sapiens (Human)
Description:
P34972
Residue:
360
  
Inhibitor
Name:
BDBM260079
Synonyms:
US9522886, 27 | US9522886, 28
Type:
Small organic molecule
Emp. Form.:
C19H25N3O3
Mol. Mass.:
343.4201
SMILES:
NC(=O)CC(NC(=O)c1ccc(C2CC2)c(OCC2CC2)n1)C1CC1
: