Target
Cannabinoid receptor 2
Ligand
BDBM260088
Substrate
Meas. Tech.
cAMP Assay
Temperature
310.15±n/a K
EC50
255.4±n/a nM
Comments
extracted
Citation
 Frei, BGobbi, LGrether, UKimbara, ANettekoven, MRoever, SRogers-Evans, MSchulz-Gasch, T Pyridine derivatives US Patent  US9522886 Publication Date 12/20/2016 
Target
Name:
Cannabinoid receptor 2
Synonyms:
CANNABINOID CB2 CB2 CB2B CNR2_HUMAN Cannabinoid CB2 receptor Cannabinoid receptor 2 (CB2R) | hCB2
Type:
G Protein-Coupled Receptor (GPCR)
Mol. Mass.:
39690.94
Organism:
Homo sapiens (Human)
Description:
P34972
Residue:
360
  
Inhibitor
Name:
BDBM260088
Synonyms:
US9522886, 36
Type:
Small organic molecule
Emp. Form.:
C18H25N3O5S
Mol. Mass.:
395.473
SMILES:
CC(C)CS(=O)(=O)c1nc(ccc1C1CC1)C(=O)NC1(CC(N)=O)COC1
: