Target
Cannabinoid receptor 1
Ligand
BDBM260146
Substrate
Meas. Tech.
cAMP Assay
Temperature
310.15±n/a K
EC50
>10000±n/a nM
Comments
extracted
Citation
 Frei, BGobbi, LGrether, UKimbara, ANettekoven, MRoever, SRogers-Evans, MSchulz-Gasch, T Pyridine derivatives US Patent  US9522886 Publication Date 12/20/2016 
Target
Name:
Cannabinoid receptor 1
Synonyms:
CANN6 CB-R CNR CNR1_HUMAN Cannabinoid receptor Cannabinoid receptor 1 (brain)
Type:
G Protein-Coupled Receptor (GPCR)
Mol. Mass.:
52868.96
Organism:
Homo sapiens (Human)
Description:
P21554
Residue:
472
  
Inhibitor
Name:
BDBM260146
Synonyms:
US9522886, 94
Type:
Small organic molecule
Emp. Form.:
C18H23N3O6
Mol. Mass.:
377.3917
SMILES:
NC(=O)CC1(COC1)NC(=O)c1ccc(c(OCC2CC2)n1)C1(O)COC1
: