Target
Vasopressin V1b receptor
Ligand
BDBM260342
Substrate
Meas. Tech.
Binding Assay
pH
7.4±n/a
Temperature
277.15±n/a K
IC50
2.9±n/a nM
Comments
extracted
Citation
 Yoshinaga, MKuwada, TMiyakoshi, NIshizaka, TWakasugi, DShirokawa, SHattori, NShimazaki, Y Azole derivative US Patent  US9522914 Publication Date 12/20/2016 
Target
Name:
Vasopressin V1b receptor
Synonyms:
AVPR V1b AVPR1B Antidiuretic hormone receptor 1b V1bR VPR3 Vasopressin V1b receptor (V1b) Vasopressin V3 receptor
Type:
Enzyme
Mol. Mass.:
46985.01
Organism:
Homo sapiens (Human)
Description:
P47901
Residue:
424
  
Inhibitor
Name:
BDBM260342
Synonyms:
US9522914, D-31
Type:
Small organic molecule
Emp. Form.:
C28H33ClFN5O3
Mol. Mass.:
542.045
SMILES:
CC(C)(C)NC(=O)Cc1nn(-c2ccc(CCN3C4CCC3COC4)cc2)c(=O)n1-c1ccc(F)c(Cl)c1
: