Target
Tyrosine-protein kinase JAK1
Ligand
BDBM260464
Substrate
Meas. Tech.
In Vitro Kinase Assay
pH
7.3±n/a
Temperature
300.15±n/a K
IC50
21±n/a nM
Comments
extracted
Citation
 Zhang, XDong, QLiu, BZhu, YLi, XLan, J Pyrrole six-membered heteroaryl ring derivative, preparation method thereof, and medicinal uses thereof US Patent  US9527851 Publication Date 12/27/2016 
Target
Name:
Tyrosine-protein kinase JAK1
Synonyms:
JAK-1 JAK1A JAK1_HUMAN Janus kinase 1 (JAK1) | Janus kinase 1 JAK1
Type:
Protein
Mol. Mass.:
133293.73
Organism:
Homo sapiens (Human)
Description:
P23458
Residue:
1154
  
Inhibitor
Name:
BDBM260464
Synonyms:
US10428074, Example 23 | US9527851, 23
Type:
Small organic molecule
Emp. Form.:
C16H21N5O2
Mol. Mass.:
315.3702
SMILES:
CN([C@H]1C[C@H]2CN(C[C@H]2C1)C(=O)CO)c1ncnc2[nH]ccc12
: