Target
Tyrosine-protein kinase BTK
Ligand
BDBM260528
Substrate
Meas. Tech.
HTRF Assay
Temperature
298.15±n/a K
IC50
5±n/a nM
Comments
extracted
Citation
 He, W Polyfluorinated compounds acting as bruton tyrosine kinase inhibitors US Patent  US9532990 Publication Date 1/3/2017 
Target
Name:
Tyrosine-protein kinase BTK
Synonyms:
AGMX1 Agammaglobulinaemia tyrosine kinase B cell progenitor kinase BPK BTK_HUMAN Tyrosine Kinase BTK Tyrosine-protein kinase BTK (BTK)
Type:
Enzyme
Mol. Mass.:
76289.95
Organism:
Homo sapiens (Human)
Description:
Q06187
Residue:
659
  
Inhibitor
Name:
BDBM260528
Synonyms:
US10300066, Compound 2 | US9532990, 2
Type:
Small organic molecule
Emp. Form.:
C26H22F2N6O2
Mol. Mass.:
488.4887
SMILES:
Nc1ncnc2n(nc(-c3ccc(cc3F)C(=O)c3ccc(F)cc3)c12)C1CCCN(C1)C(=O)C=C
: