Target
Serine/threonine-protein kinase PLK4 [1-391]
Ligand
BDBM408701
Substrate
Meas. Tech.
Inhibition Assay
IC50
<100±n/a nM
Citation
 Sampson, PBLiu, YLi, SForrest, BTPauls, HWEdwards, LGFeher, MPatel, NKLaufer, R Kinase inhibitors and method of treating cancer US Patent  US10358436 Publication Date 7/23/2019 
Target
Name:
Serine/threonine-protein kinase PLK4 [1-391]
Synonyms:
PLK4 SAK Serine/threonine-protein kinase PLK4
Type:
Protein
Mol. Mass.:
43940.49
Organism:
Homo sapiens (Human)
Description:
aa 1-391
Residue:
391
  
Inhibitor
Name:
BDBM408701
Synonyms:
US10358436, Example A117
Type:
Small organic molecule
Emp. Form.:
C28H27N5O3
Mol. Mass.:
481.5457
SMILES:
COc1ccc2NC(=O)[C@@]3(CC3c3ccc4c(n[nH]c4c3)-c3ccc(nc3)N3CCC(O)CC3)c2c1
: