Target
Serine/threonine-protein kinase PLK4 [1-391]
Ligand
BDBM375440
Substrate
Meas. Tech.
Inhibition Assay
IC50
<100±n/a nM
Citation
 Sampson, PBLiu, YLi, SForrest, BTPauls, HWEdwards, LGFeher, MPatel, NKLaufer, R Kinase inhibitors and method of treating cancer US Patent  US10358436 Publication Date 7/23/2019 
Target
Name:
Serine/threonine-protein kinase PLK4 [1-391]
Synonyms:
PLK4 SAK Serine/threonine-protein kinase PLK4
Type:
Protein
Mol. Mass.:
43940.49
Organism:
Homo sapiens (Human)
Description:
aa 1-391
Residue:
391
  
Inhibitor
Name:
BDBM375440
Synonyms:
US10358436, Example A152 | US9907800, Example A152
Type:
Small organic molecule
Emp. Form.:
C30H28N4O2
Mol. Mass.:
476.5689
SMILES:
O=C1Nc2ccccc2[C@]11CC1c1ccc2c(\C=C\c3cccc(CN4CCOCC4)c3)n[nH]c2c1
: