Target
Aurora kinase B
Ligand
BDBM375453
Substrate
Meas. Tech.
Inhibition Assay
IC50
<100±n/a nM
Citation
 Sampson, PBLiu, YLi, SForrest, BTPauls, HWEdwards, LGFeher, MPatel, NKLaufer, R Kinase inhibitors and method of treating cancer US Patent  US10358436 Publication Date 7/23/2019 
Target
Name:
Aurora kinase B
Synonyms:
AIK2 AIM1 ARK2 AURKB_HUMAN Aurora B-INCENP Aurora kinase B (AURKB) STK-1 STK12 Serine/threonine-protein kinase aurora B
Type:
Protein
Mol. Mass.:
39327.72
Organism:
Homo sapiens (Human)
Description:
Q96GD4
Residue:
344
  
Inhibitor
Name:
BDBM375453
Synonyms:
US10358436, Example A163 | US9907800, Example A163
Type:
Small organic molecule
Emp. Form.:
C29H28N6O2
Mol. Mass.:
492.5716
SMILES:
COc1ccc2NC(=O)[C@@]3(CC3c3ccc4c(\C=C\c5ccc(nc5)N5CCNCC5)n[nH]c4c3)c2c1
: