Target
Serine/threonine-protein kinase PLK4 [1-391]
Ligand
BDBM408751
Substrate
Meas. Tech.
Inhibition Assay
IC50
<100±n/a nM
Citation
 Sampson, PBLiu, YLi, SForrest, BTPauls, HWEdwards, LGFeher, MPatel, NKLaufer, R Kinase inhibitors and method of treating cancer US Patent  US10358436 Publication Date 7/23/2019 
Target
Name:
Serine/threonine-protein kinase PLK4 [1-391]
Synonyms:
PLK4 SAK Serine/threonine-protein kinase PLK4
Type:
Protein
Mol. Mass.:
43940.49
Organism:
Homo sapiens (Human)
Description:
aa 1-391
Residue:
391
  
Inhibitor
Name:
BDBM408751
Synonyms:
US10358436, Example A165
Type:
Small organic molecule
Emp. Form.:
C33H33N5O2
Mol. Mass.:
531.6474
SMILES:
NC(=O)CN1C(=O)[C@@]2(C[C@H]2c2ccc3c(\C=C\c4ccc(CN5CCCCC5)cc4)n[nH]c3c2)c2ccccc12
: