Target
Serine/threonine-protein kinase PLK4 [1-391]
Ligand
BDBM408754
Substrate
Meas. Tech.
Inhibition Assay
IC50
<100±n/a nM
Citation
 Sampson, PBLiu, YLi, SForrest, BTPauls, HWEdwards, LGFeher, MPatel, NKLaufer, R Kinase inhibitors and method of treating cancer US Patent  US10358436 Publication Date 7/23/2019 
Target
Name:
Serine/threonine-protein kinase PLK4 [1-391]
Synonyms:
PLK4 SAK Serine/threonine-protein kinase PLK4
Type:
Protein
Mol. Mass.:
43940.49
Organism:
Homo sapiens (Human)
Description:
aa 1-391
Residue:
391
  
Inhibitor
Name:
BDBM408754
Synonyms:
US10358436, Example A168
Type:
Small organic molecule
Emp. Form.:
C30H30N4O3
Mol. Mass.:
494.5842
SMILES:
COc1cc2NC(=O)[C@@]3(C[C@H]3c3ccc4c(\C=C\c5ccc(CN(C)C)cc5)n[nH]c4c3)c2cc1OC
: