Target
Aurora kinase A
Ligand
BDBM375461
Substrate
Meas. Tech.
Inhibition Assay
IC50
<100±n/a nM
Citation
 Sampson, PBLiu, YLi, SForrest, BTPauls, HWEdwards, LGFeher, MPatel, NKLaufer, R Kinase inhibitors and method of treating cancer US Patent  US10358436 Publication Date 7/23/2019 
Target
Name:
Aurora kinase A
Synonyms:
AIK ARK-1 AURA AURKA_HUMAN Aurora 2 Aurora kinase A (AURKA) Aurora kinase A (Aurora-2) Aurora/IPL1-related kinase 1 Breast tumor-amplified kinase IAK1 STK15 GN Serine/threonine kinase 15 Serine/threonine-protein kinase 6 Serine/threonine-protein kinase aurora-A aurora-2 | hARK1
Type:
Serine/threonine-protein kinase
Mol. Mass.:
45830.98
Organism:
Homo sapiens (Human)
Description:
O14965
Residue:
403
  
Inhibitor
Name:
BDBM375461
Synonyms:
US10358436, Example A171 | US9907800, Example A171
Type:
Small organic molecule
Emp. Form.:
C28H25ClN4O
Mol. Mass.:
468.977
SMILES:
CN(C)Cc1ccc(\C=C\c2n[nH]c3cc(ccc23)C2C[C@@]22C(=O)Nc3ccc(Cl)cc23)cc1
: