Target
Serine/threonine-protein kinase PLK4 [1-391]
Ligand
BDBM375463
Substrate
Meas. Tech.
Inhibition Assay
IC50
<100±n/a nM
Citation
 Sampson, PBLiu, YLi, SForrest, BTPauls, HWEdwards, LGFeher, MPatel, NKLaufer, R Kinase inhibitors and method of treating cancer US Patent  US10358436 Publication Date 7/23/2019 
Target
Name:
Serine/threonine-protein kinase PLK4 [1-391]
Synonyms:
PLK4 SAK Serine/threonine-protein kinase PLK4
Type:
Protein
Mol. Mass.:
43940.49
Organism:
Homo sapiens (Human)
Description:
aa 1-391
Residue:
391
  
Inhibitor
Name:
BDBM375463
Synonyms:
US10358436, Example A172 | US9907800, Example A172
Type:
Small organic molecule
Emp. Form.:
C27H25N5O
Mol. Mass.:
435.5203
SMILES:
CN(C)Cc1ccc(\C=C\c2n[nH]c3cc(ccc23)C2C[C@@]22C(=O)Nc3ncccc23)cc1
: