Target
Dipeptidyl peptidase 4
Ligand
BDBM408607
Substrate
Meas. Tech.
DPP-IV Activity Inhibition Tests In Vitro
IC50
0.210±n/a nM
Citation
 Gao, YWang, G Xanthine derivative US Patent  US10358449 Publication Date 7/23/2019 
Target
Name:
Dipeptidyl peptidase 4
Synonyms:
ADABP Adenosine deaminase complexing protein 2 CD_antigen=CD26 DPP4 DPPIV Dipeptidyl peptidase 4 (DPP IV) Dipeptidyl peptidase 4 (DPP4) Dipeptidyl peptidase 4 membrane form Dipeptidyl peptidase IV Dipeptidyl peptidase IV (DDP-IV) Dipeptidyl peptidase IV membrane form Dipeptidyl peptidase-IV (DPP-4) T-cell activation antigen CD26 | TP103
Type:
Enzyme
Mol. Mass.:
88271.01
Organism:
Homo sapiens (Human)
Description:
P27487
Residue:
766
  
Inhibitor
Name:
BDBM408607
Synonyms:
US10358449, Compound I-1
Type:
Small organic molecule
Emp. Form.:
C23H24FN7O2
Mol. Mass.:
449.4808
SMILES:
CC#CCn1c(nc2n(C)c(=O)n(Cc3cccc(F)c3C#N)c(=O)c12)N1CCC[C@@H](N)C1
: