Target
Indoleamine 2,3-dioxygenase 1
Ligand
BDBM408629
Substrate
Meas. Tech.
Enzyme Assay
IC50
<100.0±n/a nM
Citation
 Zhang, HLiu, S Heterocycles useful as IDO and TDO inhibitors US Patent  US10358451 Publication Date 7/23/2019 
Target
Name:
Indoleamine 2,3-dioxygenase 1
Synonyms:
I23O1_HUMAN IDO-1 INDO Indoleamine 2,3-dioxygenase | Indoleamine-pyrrole 2,3-dioxygenase
Type:
Enzyme
Mol. Mass.:
45330.80
Organism:
Homo sapiens (Human)
Description:
P14902
Residue:
403
  
Inhibitor
Name:
BDBM408629
Synonyms:
1-((3r,5r,7r)-adamantan-1-yl)-2-(6-fluoro-5H-imidazo[5,1-a]isoindol-5-yl)ethanol | US10358451, Compound 15e
Type:
Small organic molecule
Emp. Form.:
C22H23FN2O
Mol. Mass.:
350.4292
SMILES:
Fc1cccc2-c3cncn3C(CC(=O)C34CC5CC(CC(C5)C3)C4)c12
: