Target
Plasma kallikrein
Ligand
BDBM408672
Substrate
Meas. Tech.
Inhibitory Activity In Vitro Assay
IC50
2360±n/a nM
Citation
 Davie, RLEdwards, HJEvans, DMHodgson, ST N-((het) arylmethyl)-heteroaryl-carboxamides compounds as plasma kallikrein inhibitors US Patent  US10364238 Publication Date 7/30/2019 
Target
Name:
Plasma kallikrein
Synonyms:
Fletcher factor KLKB1 Kallikrein Plasma kallikrein heavy chain Plasma prekallikrein
Type:
Protein
Mol. Mass.:
71391.16
Organism:
Homo sapiens (Human)
Description:
P03952
Residue:
638
  
Inhibitor
Name:
BDBM408672
Synonyms:
N-[(3-ethoxyphenyl)methyl]-1-({4-[(4-methylpyrazol-1-yl)methyl]phenyl}methyl)-3- (trifluoromethyl)pyrazole-4-carboxamide US11001578, Example 6 US11198691, Example 6
Type:
Small organic molecule
Emp. Form.:
C26H26F3N5O2
Mol. Mass.:
497.5121
SMILES:
CCOc1cccc(CNC(=O)c2cn(Cc3ccc(Cn4cc(C)cn4)cc3)nc2C(F)(F)F)c1
: