Target
Pantetheinase
Ligand
BDBM408843
Substrate
Meas. Tech.
Enzymatic Assay
IC50
3.50±n/a nM
Citation
 Bosanac, TBurke, MJCook, BNDisalvo, DTKirrane, Jr., TMShen, Y Heteroaromatic compounds as Vanin inhibitors US Patent  US10364255 Publication Date 7/30/2019 
Target
Name:
Pantetheinase
Synonyms:
Pantetheine hydrolase VNN1 Vanin-1 | Vascular non-inflammatory molecule 1
Type:
Enzyme Catalytic Domain
Mol. Mass.:
57002.46
Organism:
Homo sapiens (Human)
Description:
O95497
Residue:
513
  
Inhibitor
Name:
BDBM408843
Synonyms:
US10364255, Ex. 34
Type:
Small organic molecule
Emp. Form.:
C18H20N4O2
Mol. Mass.:
324.377
SMILES:
C[C@H]1CNc2ncc(cc2O1)C(=O)N1CCC(C1)c1ccncc1
: