Target
5'-AMP-activated protein kinase catalytic subunit alpha-2
Ligand
BDBM327880
Substrate
Meas. Tech.
enzyme-linked immunosorbent assay
EC50
>1000±n/a nM
Citation
 Goff, DPayan, DSingh, RShaw, SCarroll, DHitoshi, Y AMPK-activating heterocyclic compounds and methods for using the same US Patent  US10377742 Publication Date 8/13/2019 
Target
Name:
5'-AMP-activated protein kinase catalytic subunit alpha-2
Synonyms:
AAPK2_HUMAN AMP-activated protein kinase, alpha-2 subunit AMPK subunit alpha-2 AMPK2 Hydroxymethylglutaryl-CoA reductase kinase | PRKAA2
Type:
Enzyme
Mol. Mass.:
62331.02
Organism:
Homo sapiens (Human)
Description:
P54646
Residue:
552
  
Inhibitor
Name:
BDBM327880
Synonyms:
5-(4-(4- fluorobenzyl)piperazine- 1-carbonyl)-N-(2- phenylphenyl) picolinamide US9663496, Compound 19
Type:
Small organic molecule
Emp. Form.:
C30H27FN4O2
Mol. Mass.:
494.5594
SMILES:
Fc1ccc(CN2CCN(CC2)C(=O)c2ccc(nc2)C(=O)Nc2ccccc2-c2ccccc2)cc1
: