Target
Tyrosine-protein kinase JAK1
Ligand
BDBM228704
Substrate
Meas. Tech.
Enzymatic Assay
IC50
<100.0±n/a nM
Citation
 Su, WDeng, WLi, JJi, J Pyrrolopyrimidine compounds and uses thereof US Patent  US10369153 Publication Date 8/6/2019 
Target
Name:
Tyrosine-protein kinase JAK1
Synonyms:
JAK-1 JAK1A JAK1_HUMAN Janus kinase 1 (JAK1) | Janus kinase 1 JAK1
Type:
Protein
Mol. Mass.:
133293.73
Organism:
Homo sapiens (Human)
Description:
P23458
Residue:
1154
  
Inhibitor
Name:
BDBM228704
Synonyms:
US10369153, Compound 251 | US9346810, 251
Type:
Small Organic Molecule
Emp. Form.:
C20H26N8O2S
Mol. Mass.:
442.538
SMILES:
CN([C@@H]1CCN(C1)c1ncnc2[nH]ccc12)c1ccc(cn1)S(=O)(=O)N1CCNCC1
: