Target
Toll-like receptor 8
Ligand
BDBM409983
Substrate
Meas. Tech.
Pharmacological Assay
EC50
10.00±n/a nM
Citation
 Wang, LYun, HZhang, WZhu, WZhang, Z Benzazepine dicarboxamide compounds with tertiary amide function US Patent  US10370338 Publication Date 8/6/2019 
Target
Name:
Toll-like receptor 8
Synonyms:
CD_antigen: CD288 TLR8_HUMAN | TRL8
Type:
Enzyme
Mol. Mass.:
119828.77
Organism:
Homo sapiens (Human)
Description:
Q9NR97
Residue:
1041
  
Inhibitor
Name:
BDBM409983
Synonyms:
2-Amino-8-(8-phenyl-3,8-diazabicyclo[3.2.1]octane-3-carbonyl)-N,N-dipropyl-3H-1-benzazepine-4-carboxamide | US10370338, Example 15
Type:
Small organic molecule
Emp. Form.:
C30H37N5O2
Mol. Mass.:
499.6471
SMILES:
CCCN(CCC)C(=O)C1=Cc2ccc(cc2N=C(N)C1)C(=O)N1CC2CCC(C1)N2c1ccccc1
: