Target
Toll-like receptor 8
Ligand
BDBM409989
Substrate
Meas. Tech.
Pharmacological Assay
EC50
9.00±n/a nM
Citation
 Wang, LYun, HZhang, WZhu, WZhang, Z Benzazepine dicarboxamide compounds with tertiary amide function US Patent  US10370338 Publication Date 8/6/2019 
Target
Name:
Toll-like receptor 8
Synonyms:
CD_antigen: CD288 TLR8_HUMAN | TRL8
Type:
Enzyme
Mol. Mass.:
119828.77
Organism:
Homo sapiens (Human)
Description:
Q9NR97
Residue:
1041
  
Inhibitor
Name:
BDBM409989
Synonyms:
2-Amino-8-[3-(anilinomethyl)pyrrolidine-1-carbonyl]-N,N-dipropyl-3H-1-benzazepine-4-carboxamide | US10370338, Example 21
Type:
Small organic molecule
Emp. Form.:
C29H37N5O2
Mol. Mass.:
487.6364
SMILES:
CCCN(CCC)C(=O)C1=Cc2ccc(cc2N=C(N)C1)C(=O)N1CCC(CNc2ccccc2)C1
: