Target
Mast/stem cell growth factor receptor Kit
Ligand
BDBM410054
Substrate
Meas. Tech.
Lantha Screen Eu Kinase Activity Assay
IC50
>10000±n/a nM
Citation
 Brekken, RADing, KRen, XTu, ZWang, ZAguilera, KY Small-molecule inhibitors targeting discoidin domain receptor 1 and uses thereof US Patent  US10370360 Publication Date 8/6/2019 
Target
Name:
Mast/stem cell growth factor receptor Kit
Synonyms:
CD117 antigen KIT Mast/stem cell growth factor receptor Kit (cKIT) Proto-oncogene tyrosine-protein kinase Kit Stem cell growth factor receptor Tyrosine-protein kinase Kit c-kit v-kit Hardy-Zuckerman 4 feline sarcoma viral oncogene homolog
Type:
Protein
Mol. Mass.:
109869.37
Organism:
Homo sapiens (Human)
Description:
P10721
Residue:
976
  
Inhibitor
Name:
BDBM410054
Synonyms:
D2103 | US10370360, Example 6
Type:
Small organic molecule
Emp. Form.:
C29H32F3N5O
Mol. Mass.:
523.5925
SMILES:
CC1CN(Cc2cc(ccc12)C(=O)Nc1cc(CN2CCN(C)CC2)cc(c1)C(F)(F)F)c1cccnc1
: