Target
Leukotriene B4 receptor 1
Ligand
BDBM410089
Substrate
Meas. Tech.
cAMP Assay
EC50
128±n/a nM
Citation
 Han, YTummanapalli, SSiliphaivanh, PSpencer, K Aryl acylsulfonamides as BLT1 antagonists US Patent  US10370368 Publication Date 8/6/2019 
Target
Name:
Leukotriene B4 receptor 1
Synonyms:
BLT BLTR Chemoattractant receptor-like 1 GPR16 LTB4-R 1 Leukotriene B4 R1 Leukotriene B4 receptor 1 P2Y purinoceptor 7 | P2Y7
Type:
Enzyme Catalytic Domain
Mol. Mass.:
37582.68
Organism:
Homo sapiens (Human)
Description:
Q15722
Residue:
352
  
Inhibitor
Name:
BDBM410089
Synonyms:
US10370368, Example 6
Type:
Small organic molecule
Emp. Form.:
C29H29N3O5S2
Mol. Mass.:
563.688
SMILES:
CC(C)(C)S(=O)(=O)NC(=O)c1ccccc1-c1ccc2[C@H](O)[C@@H](Cc3ccc(cn3)-c3cncs3)COc2c1
: