Target
Leukotriene B4 receptor 1
Ligand
BDBM410091
Substrate
Meas. Tech.
cAMP Assay
EC50
12.0±n/a nM
Citation
 Han, YTummanapalli, SSiliphaivanh, PSpencer, K Aryl acylsulfonamides as BLT1 antagonists US Patent  US10370368 Publication Date 8/6/2019 
Target
Name:
Leukotriene B4 receptor 1
Synonyms:
BLT BLTR Chemoattractant receptor-like 1 GPR16 LTB4-R 1 Leukotriene B4 R1 Leukotriene B4 receptor 1 P2Y purinoceptor 7 | P2Y7
Type:
Enzyme Catalytic Domain
Mol. Mass.:
37582.68
Organism:
Homo sapiens (Human)
Description:
Q15722
Residue:
352
  
Inhibitor
Name:
BDBM410091
Synonyms:
N-(Cyclopropylsulfonyl)-2-((rac-trans)-4-hydroxy-3-((5-(thiazol-5-yl)pyridin-2-yl)methyl)chroman-7-yl)benzamide | US10370368, Example 8
Type:
Small organic molecule
Emp. Form.:
C28H25N3O5S2
Mol. Mass.:
547.645
SMILES:
O[C@@H]1[C@@H](Cc2ccc(cn2)-c2cncs2)COc2cc(ccc12)-c1ccccc1C(=O)NS(=O)(=O)C1CC1
: