Target
Leukotriene B4 receptor 1
Ligand
BDBM410092
Substrate
Meas. Tech.
cAMP Assay
EC50
9.00±n/a nM
Citation
 Han, YTummanapalli, SSiliphaivanh, PSpencer, K Aryl acylsulfonamides as BLT1 antagonists US Patent  US10370368 Publication Date 8/6/2019 
Target
Name:
Leukotriene B4 receptor 1
Synonyms:
BLT BLTR Chemoattractant receptor-like 1 GPR16 LTB4-R 1 Leukotriene B4 R1 Leukotriene B4 receptor 1 P2Y purinoceptor 7 | P2Y7
Type:
Enzyme Catalytic Domain
Mol. Mass.:
37582.68
Organism:
Homo sapiens (Human)
Description:
Q15722
Residue:
352
  
Inhibitor
Name:
BDBM410092
Synonyms:
N-(Cyclopropylsulfonyl)-2-((rac-trans)-4-hydroxy-3-((5-(2-methylthiazol-5-yl)pyridin-2-yl)methyl)chroman-7-yl)benzamide US10370368, Example 9
Type:
Small organic molecule
Emp. Form.:
C29H27N3O5S2
Mol. Mass.:
561.672
SMILES:
Cc1ncc(s1)-c1ccc(C[C@H]2COc3cc(ccc3[C@@H]2O)-c2ccccc2C(=O)NS(=O)(=O)C2CC2)nc1
: