Target
Glycogen synthase kinase-3 alpha
Ligand
BDBM298425
Substrate
Meas. Tech.
Enzyme Inhibition
IC50
3003±n/a nM
Citation
 Baker, TMFyfe, MCJones, GThom, SM Kinase inhibitors US Patent  US10392346 Publication Date 8/27/2019 
Target
Name:
Glycogen synthase kinase-3 alpha
Synonyms:
GSK-3 alpha GSK3A_HUMAN Glycogen synthase kinase-3 Glycogen synthase kinase-3 alpha (GSK3 Alpha) Glycogen synthase kinase-3 alpha (GSK3alpha)
Type:
Enzyme
Mol. Mass.:
50991.79
Organism:
Homo sapiens (Human)
Description:
P49840
Residue:
483
  
Inhibitor
Name:
BDBM298425
Synonyms:
4-[[4-[[4-[[5-tert-butyl-3-(methanesulfonamido)-2-methoxy-phenyl]carbamoylamino]-1-naphthyl]oxy]-2-pyridyl]amino]-2,6-dimethoxy-N-(2-morpholinoethyl)benzamide US10392346, Example 17(ae) US9751837, Example 17(ae)
Type:
Small organic molecule
Emp. Form.:
C43H51N7O9S
Mol. Mass.:
841.972
SMILES:
COc1cc(Nc2cc(Oc3ccc(NC(=O)Nc4cc(cc(NS(C)(=O)=O)c4OC)C(C)(C)C)c4ccccc34)ccn2)cc(OC)c1C(=O)NCCN1CCOCC1
: