Target
Programmed cell death 1 ligand 1
Ligand
BDBM412149
Substrate
Meas. Tech.
Enzyme-Linked Immunosorbent Assay - ELISA
IC50
10250±n/a nM
Citation
 Malathong, VMcMahon, JMcMurtrie, DJPunna, SRoth, HSSingh, RZhang, P Macrocyclic immunomodulators US Patent  US10392405 Publication Date 8/27/2019 
Target
Name:
Programmed cell death 1 ligand 1
Synonyms:
B7 homolog 1 B7H1 CD274 PD-L1 PDCD1 ligand 1 PDCD1LG1 Programmed cell death 1 ligand 1 | Programmed death ligand 1
Type:
PROTEIN
Mol. Mass.:
33278.49
Organism:
Homo sapiens (Human)
Description:
ChEMBL_109807
Residue:
290
  
Inhibitor
Name:
BDBM412149
Synonyms:
US10392405, Compound Id 1.013 US11691985, Compound 1.013
Type:
Small organic molecule
Emp. Form.:
C33H32ClN3O4
Mol. Mass.:
570.078
SMILES:
Cc1c(COc2cc-3c(CN[C@@H](CCCCNC(=O)c4cncc-3c4)C(O)=O)cc2Cl)cccc1-c1ccccc1
: