Target
Interleukin-2
Ligand
BDBM412388
Substrate
Meas. Tech.
Human ELISA assay
IC50
52.0±n/a nM
Citation
 Chen, SBohnert, GJiang, JXia, Z Compounds for inflammation and immune-related uses US Patent  US10399967 Publication Date 9/3/2019 
Target
Name:
Interleukin-2
Synonyms:
IL-2 IL2_HUMAN Interleukin-2 T-cell growth factor | TCGF
Type:
Enzyme
Mol. Mass.:
17630.05
Organism:
Homo sapiens (Human)
Description:
P60568
Residue:
153
  
Inhibitor
Name:
BDBM412388
Synonyms:
(Z)-5-fluoro-N-(5-((methoxyimino)(4- methoxyphenyl)methyl)pyridin-2- yl)-4-methylnicotinamide | US10399967, Compound 18
Type:
Small organic molecule
Emp. Form.:
C21H19FN4O3
Mol. Mass.:
394.399
SMILES:
CO\N=C(\c1ccc(OC)cc1)c1ccc(NC(=O)c2cncc(F)c2C)nc1
: