Target
Interleukin-2
Ligand
BDBM412444
Substrate
Meas. Tech.
Human ELISA assay
IC50
1000±n/a nM
Citation
 Chen, SBohnert, GJiang, JXia, Z Compounds for inflammation and immune-related uses US Patent  US10399967 Publication Date 9/3/2019 
Target
Name:
Interleukin-2
Synonyms:
IL-2 IL2_HUMAN Interleukin-2 T-cell growth factor | TCGF
Type:
Enzyme
Mol. Mass.:
17630.05
Organism:
Homo sapiens (Human)
Description:
P60568
Residue:
153
  
Inhibitor
Name:
BDBM412444
Synonyms:
5-fluoro-4-methyl-N-(5-(1- phenylcyclopropyl)pyrazin-2- yl)nicotinamide | US10399967, Compound 74
Type:
Small organic molecule
Emp. Form.:
C20H17FN4O
Mol. Mass.:
348.3736
SMILES:
Cc1c(F)cncc1C(=O)Nc1cnc(cn1)C1(CC1)c1ccccc1
: