Target
Nuclear receptor ROR-gamma
Ligand
BDBM317947
Substrate
Meas. Tech.
Radio-Ligand ROR gamma Binding Assay (Assay 1)
Ki
>1000±n/a nM
Citation
 Claremon, DADillard, LWDong, CFan, YJia, LLiu, ZLotesta, SDMarcus, ASingh, SBTice, CMYuan, JZhao, WZheng, YZhuang, L Dihydropyrrolopyridine inhibitors of ROR-gamma US Patent  US10399976 Publication Date 9/3/2019 
Target
Name:
Nuclear receptor ROR-gamma
Synonyms:
NR1F3 Nuclear receptor ROR-gamma (RORC) RAR-related orphan receptor C (RORc) RORG RZRG Retinoid-related orphan receptor-gamma (RORc)
Type:
Enzyme Catalytic Domain
Mol. Mass.:
58218.40
Organism:
Homo sapiens (Human)
Description:
P51449
Residue:
518
  
Inhibitor
Name:
BDBM317947
Synonyms:
US10399976, Compound 100 US11535614, Compound 100 | US9624217, Compound 100
Type:
Small organic molecule
Emp. Form.:
C26H33F3N4O
Mol. Mass.:
474.5616
SMILES:
CC(C)[C@@H]1N(Cc2ccc(cc2)C(F)(F)F)Cc2cc(cnc12)C(=O)NCC1CCN(C)CC1
: