Target
TGF-beta receptor type-1 [4-503,T204D]
Ligand
BDBM412771
Substrate
Meas. Tech.
Biological Assays
IC50
1.70±n/a nM
Citation
 Harikrishnan, LSFink, BEBorzilleri, RMTonukunuru, GSankara Warrier, J TGF beta receptor antagonists US Patent  US10399987 Publication Date 9/3/2019 
Target
Name:
TGF-beta receptor type-1 [4-503,T204D]
Synonyms:
ALK5 TGF-beta receptor type-1 T204D TGFR-1 T204D | TGFR1_HUMAN
Type:
Enzyme Catalytic Domain
Mol. Mass.:
55650.84
Organism:
Homo sapiens (Human)
Description:
P36897 T204D
Residue:
500
  
Inhibitor
Name:
BDBM412771
Synonyms:
N-[3-fluoro-4-({2-[6-(trifluoromethyl)pyridin-2-yl]-7H-pyrrolo[2,3-d]pyrimidin-4-yl}amino)pyridin-2-yl]acetamide | US10399987, Example 36
Type:
Small organic molecule
Emp. Form.:
C19H13F4N7O
Mol. Mass.:
431.3464
SMILES:
CC(=O)Nc1nccc(Nc2nc(nc3[nH]ccc23)-c2cccc(n2)C(F)(F)F)c1F
: