Target
Epidermal growth factor receptor
Ligand
BDBM412796
Substrate
Meas. Tech.
EGFR Binding Affinity
IC50
5500±n/a nM
Citation
 Guisot, N Pyrazolopyrimidine derivatives as BTK inhibitors for the treatment of cancer US Patent  US10399989 Publication Date 9/3/2019 
Target
Name:
Epidermal growth factor receptor
Synonyms:
EGF Receptor Substrate EGFR_HUMAN ERBB1 Epidermal Growth Factor Receptor erbB-1 Epidermal growth factor receptor (EGFR) HER1 Proto-oncogene c-ErbB-1 Tyrosine-Protein Kinase ErbB-1
Type:
Receptor Kinase Domain
Mol. Mass.:
134279.59
Organism:
Homo sapiens (Human)
Description:
P00533
Residue:
1210
  
Inhibitor
Name:
BDBM412796
Synonyms:
US10399989, Example 12 | US10611766, Example 12
Type:
Small organic molecule
Emp. Form.:
C26H28N6O2
Mol. Mass.:
456.5395
SMILES:
COc1ccc(C)cc1C(=O)NCc1ccc(cc1)-c1nn(C2CCCC2)c2ncnc(N)c12
: