Target
Tyrosine-protein kinase BTK
Ligand
BDBM412838
Substrate
Meas. Tech.
BTKWT Binding Affinity
IC50
<10±n/a nM
Citation
 Guisot, N Pyrazolopyrimidine derivatives as BTK inhibitors for the treatment of cancer US Patent  US10399989 Publication Date 9/3/2019 
Target
Name:
Tyrosine-protein kinase BTK
Synonyms:
AGMX1 Agammaglobulinaemia tyrosine kinase B cell progenitor kinase BPK BTK_HUMAN Tyrosine Kinase BTK Tyrosine-protein kinase BTK (BTK)
Type:
Enzyme
Mol. Mass.:
76289.95
Organism:
Homo sapiens (Human)
Description:
Q06187
Residue:
659
  
Inhibitor
Name:
BDBM412838
Synonyms:
N-[[4-(4-amino-1-tert-butyl-pyrazolo[3,4-d]pyrimidin-3-yl)phenyl]methyl]-2-methoxy-benzamide US10611766, Example 51
Type:
Small organic molecule
Emp. Form.:
C24H26N6O2
Mol. Mass.:
430.5022
SMILES:
COc1ccccc1C(=O)NCc1ccc(cc1)-c1nn(c2ncnc(N)c12)C(C)(C)C
: