Target
Tyrosine-protein kinase BTK [C481S]
Ligand
BDBM412843
Substrate
Meas. Tech.
BTKC481S Binding Affinity
IC50
<10±n/a nM
Citation
 Guisot, N Pyrazolopyrimidine derivatives as BTK inhibitors for the treatment of cancer US Patent  US10399989 Publication Date 9/3/2019 
Target
Name:
Tyrosine-protein kinase BTK [C481S]
Synonyms:
AGMX1 BPK BTK C481S Tyrosine-protein kinase BTK (C481S) | Tyrosine-protein kinase BTK C481S
Type:
Enzyme Catalytic Domain
Mol. Mass.:
76273.88
Organism:
Homo sapiens (Human)
Description:
Q06187[C481S]
Residue:
659
  
Inhibitor
Name:
BDBM412843
Synonyms:
N-[[4-[4-amino-1-[(1R)-indan-1-yl]pyrazolo[3,4-d]pyrimidin-3-yl]phenyl]methyl]-2-methoxy-benzamide US10611766, Example 56
Type:
Small organic molecule
Emp. Form.:
C29H26N6O2
Mol. Mass.:
490.5557
SMILES:
COc1ccccc1C(=O)NCc1ccc(cc1)-c1nn([C@@H]2CCc3ccccc23)c2ncnc(N)c12
: