Target
Tyrosine-protein kinase BTK
Ligand
BDBM412845
Substrate
Meas. Tech.
BTKWT Binding Affinity
IC50
<10±n/a nM
Citation
 Guisot, N Pyrazolopyrimidine derivatives as BTK inhibitors for the treatment of cancer US Patent  US10399989 Publication Date 9/3/2019 
Target
Name:
Tyrosine-protein kinase BTK
Synonyms:
AGMX1 Agammaglobulinaemia tyrosine kinase B cell progenitor kinase BPK BTK_HUMAN Tyrosine Kinase BTK Tyrosine-protein kinase BTK (BTK)
Type:
Enzyme
Mol. Mass.:
76289.95
Organism:
Homo sapiens (Human)
Description:
Q06187
Residue:
659
  
Inhibitor
Name:
BDBM412845
Synonyms:
US10399989, Example 58 | US10611766, Example 58
Type:
Small organic molecule
Emp. Form.:
C28H30N6O4
Mol. Mass.:
514.5756
SMILES:
COCCNc1ncnc2n(nc(-c3ccc(CNC(=O)c4ccccc4OC)cc3)c12)[C@@H]1C[C@@H](O)C=C1
: