Target
Tyrosine-protein kinase BTK
Ligand
BDBM412847
Substrate
Meas. Tech.
BTKWT Binding Affinity
IC50
<10±n/a nM
Citation
 Guisot, N Pyrazolopyrimidine derivatives as BTK inhibitors for the treatment of cancer US Patent  US10399989 Publication Date 9/3/2019 
Target
Name:
Tyrosine-protein kinase BTK
Synonyms:
AGMX1 Agammaglobulinaemia tyrosine kinase B cell progenitor kinase BPK BTK_HUMAN Tyrosine Kinase BTK Tyrosine-protein kinase BTK (BTK)
Type:
Enzyme
Mol. Mass.:
76289.95
Organism:
Homo sapiens (Human)
Description:
Q06187
Residue:
659
  
Inhibitor
Name:
BDBM412847
Synonyms:
US10399989, Example 60 | US10611766, Example 60
Type:
Small organic molecule
Emp. Form.:
C27H27N7O3
Mol. Mass.:
497.5484
SMILES:
COc1ccccc1C(=O)NCc1ccc(cc1)-c1nn([C@@H]2C[C@@H](NC(C)=O)C=C2)c2ncnc(N)c12
: