Target
Tyrosine-protein kinase BTK [C481S]
Ligand
BDBM412848
Substrate
Meas. Tech.
BTKC481S Binding Affinity
IC50
<10±n/a nM
Citation
 Guisot, N Pyrazolopyrimidine derivatives as BTK inhibitors for the treatment of cancer US Patent  US10399989 Publication Date 9/3/2019 
Target
Name:
Tyrosine-protein kinase BTK [C481S]
Synonyms:
AGMX1 BPK BTK C481S Tyrosine-protein kinase BTK (C481S) | Tyrosine-protein kinase BTK C481S
Type:
Enzyme Catalytic Domain
Mol. Mass.:
76273.88
Organism:
Homo sapiens (Human)
Description:
Q06187[C481S]
Residue:
659
  
Inhibitor
Name:
BDBM412848
Synonyms:
US10399989, Example 61 | US10611766, Example 61
Type:
Small organic molecule
Emp. Form.:
C27H25N9O2
Mol. Mass.:
507.5465
SMILES:
COc1ccccc1C(=O)NCc1ccc(cc1)-c1nn([C@@H]2C[C@H](C=C2)n2ccnn2)c2ncnc(N)c12
: