Target
Tyrosine-protein kinase BTK [C481S]
Ligand
BDBM412853
Substrate
Meas. Tech.
BTKC481S Binding Affinity
IC50
<10±n/a nM
Citation
 Guisot, N Pyrazolopyrimidine derivatives as BTK inhibitors for the treatment of cancer US Patent  US10399989 Publication Date 9/3/2019 
Target
Name:
Tyrosine-protein kinase BTK [C481S]
Synonyms:
AGMX1 BPK BTK C481S Tyrosine-protein kinase BTK (C481S) | Tyrosine-protein kinase BTK C481S
Type:
Enzyme Catalytic Domain
Mol. Mass.:
76273.88
Organism:
Homo sapiens (Human)
Description:
Q06187[C481S]
Residue:
659
  
Inhibitor
Name:
BDBM412853
Synonyms:
N-[[4-(4-amino-1-cyclopentyl-pyrazolo[3,4-d]pyrimidin-3-yl)-2-fluoro-phenyl]methyl]-2-methoxy-benzamide US10611766, Example 66
Type:
Small organic molecule
Emp. Form.:
C25H25FN6O2
Mol. Mass.:
460.5034
SMILES:
COc1ccccc1C(=O)NCc1ccc(cc1F)-c1nn(C2CCCC2)c2ncnc(N)c12
: