Target
Tyrosine-protein kinase BTK
Ligand
BDBM412857
Substrate
Meas. Tech.
BTKWT Binding Affinity
IC50
<10±n/a nM
Citation
 Guisot, N Pyrazolopyrimidine derivatives as BTK inhibitors for the treatment of cancer US Patent  US10399989 Publication Date 9/3/2019 
Target
Name:
Tyrosine-protein kinase BTK
Synonyms:
AGMX1 Agammaglobulinaemia tyrosine kinase B cell progenitor kinase BPK BTK_HUMAN Tyrosine Kinase BTK Tyrosine-protein kinase BTK (BTK)
Type:
Enzyme
Mol. Mass.:
76289.95
Organism:
Homo sapiens (Human)
Description:
Q06187
Residue:
659
  
Inhibitor
Name:
BDBM412857
Synonyms:
US10399989, Example 70 | US10611766, Example 70
Type:
Small organic molecule
Emp. Form.:
C27H25N7O
Mol. Mass.:
463.5337
SMILES:
Nc1ncnc2n(nc(-c3ccc(CNC(=O)c4cccc5cccnc45)cc3)c12)C1CCCC1
: