Target
Tyrosine-protein kinase BTK [C481S]
Ligand
BDBM412857
Substrate
Meas. Tech.
BTKC481S Binding Affinity
IC50
<10±n/a nM
Citation
 Guisot, N Pyrazolopyrimidine derivatives as BTK inhibitors for the treatment of cancer US Patent  US10399989 Publication Date 9/3/2019 
Target
Name:
Tyrosine-protein kinase BTK [C481S]
Synonyms:
AGMX1 BPK BTK C481S Tyrosine-protein kinase BTK (C481S) | Tyrosine-protein kinase BTK C481S
Type:
Enzyme Catalytic Domain
Mol. Mass.:
76273.88
Organism:
Homo sapiens (Human)
Description:
Q06187[C481S]
Residue:
659
  
Inhibitor
Name:
BDBM412857
Synonyms:
US10399989, Example 70 | US10611766, Example 70
Type:
Small organic molecule
Emp. Form.:
C27H25N7O
Mol. Mass.:
463.5337
SMILES:
Nc1ncnc2n(nc(-c3ccc(CNC(=O)c4cccc5cccnc45)cc3)c12)C1CCCC1
: