Target
Tyrosine-protein kinase BTK
Ligand
BDBM412810
Substrate
Meas. Tech.
BTKWT Binding Affinity
IC50
2.20±n/a nM
Citation
 Guisot, N Pyrazolopyrimidine derivatives as BTK inhibitors for the treatment of cancer US Patent  US10399989 Publication Date 9/3/2019 
Target
Name:
Tyrosine-protein kinase BTK
Synonyms:
AGMX1 Agammaglobulinaemia tyrosine kinase B cell progenitor kinase BPK BTK_HUMAN Tyrosine Kinase BTK Tyrosine-protein kinase BTK (BTK)
Type:
Enzyme
Mol. Mass.:
76289.95
Organism:
Homo sapiens (Human)
Description:
Q06187
Residue:
659
  
Inhibitor
Name:
BDBM412810
Synonyms:
N-[[4-[4-amino-1-[(1R*,3S*)-3-hydroxycyclopentyl]pyrazolo[3,4-d]pyrimidin-3-yl]phenyl]methyl]-2-methoxy-benzamide US10611766, Example 24
Type:
Small organic molecule
Emp. Form.:
C25H26N6O3
Mol. Mass.:
458.5123
SMILES:
COc1ccccc1C(=O)NCc1ccc(cc1)-c1nn([C@@H]2CC[C@H](O)C2)c2ncnc(N)c12
: