Target
Tyrosine-protein kinase BTK
Ligand
BDBM412828
Substrate
Meas. Tech.
BTKWT Binding Affinity
IC50
1.20±n/a nM
Citation
 Guisot, N Pyrazolopyrimidine derivatives as BTK inhibitors for the treatment of cancer US Patent  US10399989 Publication Date 9/3/2019 
Target
Name:
Tyrosine-protein kinase BTK
Synonyms:
AGMX1 Agammaglobulinaemia tyrosine kinase B cell progenitor kinase BPK BTK_HUMAN Tyrosine Kinase BTK Tyrosine-protein kinase BTK (BTK)
Type:
Enzyme
Mol. Mass.:
76289.95
Organism:
Homo sapiens (Human)
Description:
Q06187
Residue:
659
  
Inhibitor
Name:
BDBM412828
Synonyms:
Ethyl 3-[4-amino-3-[4-[[(2-methoxybenzoyl)amino]methyl]phenyl]pyrazolo[3,4-d]pyrimidin-1-yl]cyclohexanecarboxylate US10611766, Example 41
Type:
Small organic molecule
Emp. Form.:
C29H32N6O4
Mol. Mass.:
528.6022
SMILES:
CCOC(=O)C1CCCC(C1)n1nc(-c2ccc(CNC(=O)c3ccccc3OC)cc2)c2c(N)ncnc12
: