Target
Tyrosine-protein kinase BTK
Ligand
BDBM412841
Substrate
Meas. Tech.
BTKWT Binding Affinity
IC50
0.700±n/a nM
Citation
 Guisot, N Pyrazolopyrimidine derivatives as BTK inhibitors for the treatment of cancer US Patent  US10399989 Publication Date 9/3/2019 
Target
Name:
Tyrosine-protein kinase BTK
Synonyms:
AGMX1 Agammaglobulinaemia tyrosine kinase B cell progenitor kinase BPK BTK_HUMAN Tyrosine Kinase BTK Tyrosine-protein kinase BTK (BTK)
Type:
Enzyme
Mol. Mass.:
76289.95
Organism:
Homo sapiens (Human)
Description:
Q06187
Residue:
659
  
Inhibitor
Name:
BDBM412841
Synonyms:
N-[[4-[4-amino-1-[(1R,4R)-4-fluorocyclopent-2-en-1-yl]pyrazolo[3,4-d]pyrimidin-3-yl]phenyl]methyl]-2-methoxy-benzamide US10611766, Example 54
Type:
Small organic molecule
Emp. Form.:
C25H23FN6O2
Mol. Mass.:
458.4875
SMILES:
COc1ccccc1C(=O)NCc1ccc(cc1)-c1nn([C@@H]2C[C@@H](F)C=C2)c2ncnc(N)c12
: